province-n
type: LexicalEntry
canonical form: province
sense: 14539235-n
part of speech: noun

responsibility-n
type: LexicalEntry
canonical form: responsibility
sense: 14539235-n
part of speech: noun

14539235-n
type: LexicalConcept
in scheme: en-word.net
definition: the proper sphere or extent of your activities
example: it was his province to take care of himself
ili: i113284
lexfile: noun.state
part of speech: noun
hypernym: 14537641-n