obstruction-n
type: LexicalEntry
canonical form: obstruction
sense: 14531553-n
part of speech: noun

blockage-n
type: LexicalEntry
canonical form: blockage
sense: 14531553-n
part of speech: noun

14531553-n
type: LexicalConcept
in scheme: en-word.net
definition: the physical condition of blocking or filling a passage with an obstruction
ili: i113243
lexfile: noun.state
part of speech: noun
hypernym: 14057659-n