purity-n
type: LexicalEntry
canonical form: purity
sense: 14510351-n
part of speech: noun

pureness-n
type: LexicalEntry
canonical form: pureness
sense: 14510351-n
part of speech: noun

14510351-n
type: LexicalConcept
in scheme: en-word.net
definition: being undiluted or unmixed with extraneous material
ili: i113131
lexfile: noun.state
part of speech: noun
attribute: https://en-word.net/synset/01911832-a
attribute: https://en-word.net/synset/01914420-a
hypernym: 13943868-n