phase-n
type: LexicalEntry
canonical form: phase
sense: 14503649-n
part of speech: noun

form-n
type: LexicalEntry
canonical form: form
sense: 14503649-n
part of speech: noun

14503649-n
type: LexicalConcept
in scheme: en-word.net
definition: (physical chemistry) a distinct state of matter in a system; matter that is identical in chemical composition and physical state and separated from other material by the phase boundary
example: the reaction occurs in the liquid phase of the system
ili: i113098
lexfile: noun.state
part of speech: noun
domain topic: 06099035-n
hypernym: 14503199-n