bankruptcy-n
type: LexicalEntry
canonical form: bankruptcy
sense: 14502017-n
part of speech: noun

failure-n
type: LexicalEntry
canonical form: failure
sense: 14502017-n
part of speech: noun

14502017-n
type: LexicalConcept
in scheme: en-word.net
definition: inability to discharge all your debts as they come due
example: the company had to declare bankruptcy
example: fraudulent loans led to the failure of many banks
ili: i113090
lexfile: noun.state
part of speech: noun
hypernym: 14501875-n