extremity-n
type: LexicalEntry
canonical form: extremity
sense: 14500105-n
part of speech: noun

14500105-n
type: LexicalConcept
in scheme: en-word.net
definition: an extreme condition or state (especially of adversity or disease)
ili: i113079
lexfile: noun.state
part of speech: noun
hypernym: 14499245-n