pediculosis-n
type: LexicalEntry
canonical form: pediculosis
sense: 14477916-n
part of speech: noun

lousiness-n
type: LexicalEntry
canonical form: lousiness
sense: 14477916-n
part of speech: noun

14477916-n
type: LexicalConcept
in scheme: en-word.net
definition: infestation with lice (Pediculus humanus) resulting in severe itching
ili: i112967
lexfile: noun.state
part of speech: noun
hypernym: 14476082-n