relief-n
type: LexicalEntry
canonical form: relief
sense: 14469215-n
part of speech: noun

ease-n
type: LexicalEntry
canonical form: ease
sense: 14469215-n
part of speech: noun

14469215-n
type: LexicalConcept
in scheme: en-word.net
definition: the condition of being comfortable or relieved (especially after being relieved of distress)
example: he enjoyed his relief from responsibility
example: getting it off his conscience gave him some ease
ili: i112921
lexfile: noun.state
part of speech: noun
hypernym: 14468845-n