regulation-n
type: LexicalEntry
canonical form: regulation
sense: 14466900-n
part of speech: noun

14466900-n
type: LexicalConcept
in scheme: en-word.net
definition: the state of being controlled or governed
ili: i112909
lexfile: noun.state
part of speech: noun
hypernym: 14465291-n