association-n
type: LexicalEntry
canonical form: association
sense: 14444543-n
part of speech: noun

14444543-n
type: LexicalConcept
in scheme: en-word.net
definition: the state of being connected together as in memory or imagination
example: his association of his father with being beaten was too strong to break
ili: i112789
lexfile: noun.state
part of speech: noun
hypernym: 14441799-n