bosom-n
type: LexicalEntry
canonical form: bosom
sense: 14439877-n
part of speech: noun

14439877-n
type: LexicalConcept
in scheme: en-word.net
definition: the chest considered as the place where secret thoughts are kept
example: his bosom was bursting with the secret
ili: i112766
lexfile: noun.state
part of speech: noun
domain topic: 00845915-n
exemplifies: 07087487-n
hypernym: 14439493-n