stress-n
type: LexicalEntry
canonical form: stress
sense: 14433493-n
part of speech: noun

strain-n
type: LexicalEntry
canonical form: strain
sense: 14433493-n
part of speech: noun

14433493-n
type: LexicalConcept
in scheme: en-word.net
definition: difficulty that causes worry or emotional tension
example: she endured the stresses and strains of life
example: he presided over the economy during the period of the greatest stress and danger
  source: R.J.Samuelson
ili: i112734
lexfile: noun.state
part of speech: noun
hypernym: 04716529-n