corner-n
type: LexicalEntry
canonical form: corner
sense: 14432355-n
part of speech: noun

box-n
type: LexicalEntry
canonical form: box
sense: 14432355-n
part of speech: noun

14432355-n
type: LexicalConcept
in scheme: en-word.net
definition: a predicament from which a skillful or graceful escape is impossible
example: his lying got him into a tight corner
ili: i112727
lexfile: noun.state
part of speech: noun
hypernym: 14432050-n