melancholia-n
type: LexicalEntry
canonical form: melancholia
sense: 14415896-n
part of speech: noun

14415896-n
type: LexicalConcept
in scheme: en-word.net
definition: extreme depression characterized by tearful sadness and irrational fears
ili: i112646
lexfile: noun.state
part of speech: noun
hypernym: 14427564-n