mania-n
type: LexicalEntry
canonical form: mania
sense: 14415065-n
part of speech: noun

manic disorder-n
type: LexicalEntry
canonical form: manic disorder
sense: 14415065-n
part of speech: noun

14415065-n
type: LexicalConcept
in scheme: en-word.net
definition: a mood disorder; an affective disorder in which the victim tends to respond excessively and sometimes violently
ili: i112642
lexfile: noun.state
part of speech: noun
exemplifies: 06730109-n
hypernym: 14412315-n