delusion-n
type: LexicalEntry
canonical form: delusion
sense: 14400260-n
part of speech: noun

psychotic belief-n
type: LexicalEntry
canonical form: psychotic belief
sense: 14400260-n
part of speech: noun

14400260-n
type: LexicalConcept
in scheme: en-word.net
definition: (psychology) an erroneous belief that is held in the face of evidence to the contrary
ili: i112552
lexfile: noun.state
part of speech: noun
domain topic: 06145709-n
hypernym: 14396987-n