morale-n
type: LexicalEntry
canonical form: morale
sense: 14397678-n
part of speech: noun

14397678-n
type: LexicalConcept
in scheme: en-word.net
definition: a state of individual psychological well-being based upon a sense of confidence and usefulness and purpose
ili: i112539
lexfile: noun.state
part of speech: noun
hypernym: 14396987-n