hardening-n
type: LexicalEntry
canonical form: hardening
sense: 14387837-n
part of speech: noun

14387837-n
type: LexicalConcept
in scheme: en-word.net
definition: abnormal hardening or thickening of tissue
ili: i112485
lexfile: noun.state
part of speech: noun
hypernym: 14323139-n