sign-n
type: LexicalEntry
canonical form: sign
sense: 14325305-n
part of speech: noun

14325305-n
type: LexicalConcept
in scheme: en-word.net
definition: (medicine) any objective evidence of the presence of a disorder or disease
example: there were no signs of asphyxiation
ili: i112110
lexfile: noun.state
part of speech: noun
domain topic: 06052606-n
hypernym: 05832256-n