pinch-n
type: LexicalEntry
canonical form: pinch
sense: 14318642-n
part of speech: noun

14318642-n
type: LexicalConcept
in scheme: en-word.net
definition: an injury resulting from getting some body part squeezed
ili: i112083
lexfile: noun.state
part of speech: noun
hypernym: 14309164-n