dislocation-n
type: LexicalEntry
canonical form: dislocation
sense: 14315063-n
part of speech: noun

14315063-n
type: LexicalConcept
in scheme: en-word.net
definition: a displacement of a part (especially a bone) from its normal position (as in the shoulder or the vertebral column)
ili: i112062
lexfile: noun.state
part of speech: noun
hypernym: 14309164-n