leiomyoma-n
type: LexicalEntry
canonical form: leiomyoma
sense: 14272866-n
part of speech: noun

14272866-n
type: LexicalConcept
in scheme: en-word.net
definition: benign tumor of smooth muscle (usually in the uterus or digestive tract)
ili: i111803
lexfile: noun.state
part of speech: noun
hypernym: 14272023-n