growth-n
type: LexicalEntry
canonical form: growth
sense: 14257556-n
part of speech: noun

14257556-n
type: LexicalConcept
in scheme: en-word.net
definition: (pathology) an abnormal proliferation of tissue (as in a tumor)
ili: i111717
lexfile: noun.state
part of speech: noun
domain topic: 06070395-n
hypernym: 14085287-n