flare-n
type: LexicalEntry
canonical form: flare
sense: 14250839-n
part of speech: noun

14250839-n
type: LexicalConcept
in scheme: en-word.net
definition: reddening of the skin spreading outward from a focus of infection or irritation
ili: i111677
lexfile: noun.state
part of speech: noun
hypernym: 14250700-n