noma-n
type: LexicalEntry
canonical form: noma
sense: 14236526-n
part of speech: noun

14236526-n
type: LexicalConcept
in scheme: en-word.net
definition: acute ulceration of the mucous membranes of the mouth or genitals; often seen in undernourished children
ili: i111589
lexfile: noun.state
part of speech: noun
hypernym: 14235091-n