lesion-n
type: LexicalEntry
canonical form: lesion
sense: 14234776-n
part of speech: noun

14234776-n
type: LexicalConcept
in scheme: en-word.net
definition: any localized abnormal structural change in a bodily part
ili: i111578
lexfile: noun.state
part of speech: noun
hypernym: 14228432-n