adhesion-n
type: LexicalEntry
canonical form: adhesion
sense: 14229706-n
part of speech: noun

14229706-n
type: LexicalConcept
in scheme: en-word.net
definition: abnormal union of bodily tissues; most common in the abdomen
ili: i111548
lexfile: noun.state
part of speech: noun
hypernym: 14228432-n