scabies-n
type: LexicalEntry
canonical form: scabies
sense: 14203809-n
part of speech: noun

itch-n
type: LexicalEntry
canonical form: itch
sense: 14203809-n
part of speech: noun

14203809-n
type: LexicalConcept
in scheme: en-word.net
definition: a contagious skin infection caused by the itch mite; characterized by persistent itching and skin irritation
example: he has a bad case of the itch
ili: i111413
lexfile: noun.state
part of speech: noun
hypernym: 14198031-n