infectious disease-n
type: LexicalEntry
canonical form: infectious disease
sense: 14150693-n
part of speech: noun

14150693-n
type: LexicalConcept
in scheme: en-word.net
definition: a disease transmitted only by a specific kind of contact
ili: i111170
lexfile: noun.state
part of speech: noun
hypernym: 14145535-n