flutter-n
type: LexicalEntry
canonical form: flutter
sense: 14134837-n
part of speech: noun

14134837-n
type: LexicalConcept
in scheme: en-word.net
definition: abnormally rapid beating of the auricles of the heart (especially in a regular rhythm); can result in heart block
ili: i111092
lexfile: noun.state
part of speech: noun
hypernym: 14134156-n