potency-n
type: LexicalEntry
canonical form: potency
sense: 14075210-n
part of speech: noun

potence-n
type: LexicalEntry
canonical form: potence
sense: 14075210-n
part of speech: noun

14075210-n
type: LexicalConcept
in scheme: en-word.net
definition: the state of being potent; a male's capacity to have sexual intercourse
ili: i110774
lexfile: noun.state
part of speech: noun
hypernym: 14057659-n