radiance-n
type: LexicalEntry
canonical form: radiance
sense: 14074683-n
part of speech: noun

14074683-n
type: LexicalConcept
in scheme: en-word.net
definition: an attractive combination of good health and happiness
example: the radiance of her countenance
ili: i110771
lexfile: noun.state
part of speech: noun
hypernym: 14010908-n
hypernym: 14073193-n