muscularity-n
type: LexicalEntry
canonical form: muscularity
sense: 14068201-n
part of speech: noun

14068201-n
type: LexicalConcept
in scheme: en-word.net
definition: the physiological state of having or consisting of muscle
ili: i110737
lexfile: noun.state
part of speech: noun
hypernym: 14057659-n