hunger-n
type: LexicalEntry
canonical form: hunger
sense: 14063016-n
part of speech: noun

hungriness-n
type: LexicalEntry
canonical form: hungriness
sense: 14063016-n
part of speech: noun

14063016-n
type: LexicalConcept
in scheme: en-word.net
definition: a physiological need for food; the consequence of food deprivation
ili: i110708
lexfile: noun.state
part of speech: noun
hypernym: 14058780-n