alert-n
type: LexicalEntry
canonical form: alert
sense: 14055142-n
part of speech: noun

qui vive-n
type: LexicalEntry
canonical form: qui vive
sense: 14055142-n
part of speech: noun

14055142-n
type: LexicalConcept
in scheme: en-word.net
definition: condition of heightened watchfulness or preparation for action
example: bombers were put on alert during the crisis
ili: i110670
lexfile: noun.state
part of speech: noun
hypernym: 14054590-n