arousal-n
type: LexicalEntry
canonical form: arousal
sense: 14047468-n
part of speech: noun

14047468-n
type: LexicalConcept
in scheme: en-word.net
definition: a state of heightened physiological activity
ili: i110633
lexfile: noun.state
part of speech: noun
hypernym: 14057659-n