deferral-n
type: LexicalEntry
canonical form: deferral
sense: 14037117-n
part of speech: noun

recess-n
type: LexicalEntry
canonical form: recess
sense: 14037117-n
part of speech: noun

14037117-n
type: LexicalConcept
in scheme: en-word.net
definition: a state of abeyance or suspended business
ili: i110572
lexfile: noun.state
part of speech: noun
hypernym: 14034107-n