behavior-n
type: LexicalEntry
canonical form: behavior
sense: 14031827-n
part of speech: noun

behaviour-n
type: LexicalEntry
canonical form: behaviour
sense: 14031827-n
part of speech: noun

14031827-n
type: LexicalConcept
in scheme: en-word.net
definition: the action or reaction of something (as a machine or substance) under specified circumstances
example: the behavior of small particles can be studied in experiments
ili: i110547
lexfile: noun.state
part of speech: noun
hypernym: 14030430-n