solitary confinement-n
type: LexicalEntry
canonical form: solitary confinement
sense: 14023426-n
part of speech: noun

solitary-n
type: LexicalEntry
canonical form: solitary
sense: 14023426-n
part of speech: noun

14023426-n
type: LexicalConcept
in scheme: en-word.net
definition: confinement of a prisoner in isolation from other prisoners
example: he was held in solitary
ili: i110505
lexfile: noun.state
part of speech: noun
hypernym: 14022061-n