license-n
type: LexicalEntry
canonical form: license
sense: 14018291-n
part of speech: noun

licence-n
type: LexicalEntry
canonical form: licence
sense: 14018291-n
part of speech: noun

14018291-n
type: LexicalConcept
in scheme: en-word.net
definition: freedom to deviate deliberately from normally applicable rules or practices (especially in behavior or speech)
ili: i110478
lexfile: noun.state
part of speech: noun
hypernym: 14017941-n