latent hostility-n
type: LexicalEntry
canonical form: latent hostility
sense: 14004081-n
part of speech: noun

tension-n
type: LexicalEntry
canonical form: tension
sense: 14004081-n
part of speech: noun

14004081-n
type: LexicalConcept
in scheme: en-word.net
definition: feelings of hostility that are not manifest
example: he could sense her latent hostility to him
example: the diplomats' first concern was to reduce international tensions
ili: i110405
lexfile: noun.state
part of speech: noun
hypernym: 14003773-n