violence-n
type: LexicalEntry
canonical form: violence
sense: 14003462-n
part of speech: noun

14003462-n
type: LexicalConcept
in scheme: en-word.net
definition: a turbulent state resulting in injuries and destruction etc.
ili: i110402
lexfile: noun.state
part of speech: noun
hypernym: 14002658-n