footing-n
type: LexicalEntry
canonical form: footing
sense: 13977154-n
part of speech: noun

terms-n
type: LexicalEntry
canonical form: terms
sense: 13977154-n
part of speech: noun

13977154-n
type: LexicalConcept
in scheme: en-word.net
definition: status with respect to the relations between people or groups
example: on good terms with her in-laws
example: on a friendly footing
ili: i110267
lexfile: noun.state
part of speech: noun
hypernym: 13968971-n