acceptance-n
type: LexicalEntry
canonical form: acceptance
sense: 13955454-n
part of speech: noun

13955454-n
type: LexicalConcept
in scheme: en-word.net
definition: the state of being acceptable and accepted
example: torn jeans received no acceptance at the country club
ili: i110159
lexfile: noun.state
part of speech: noun
hypernym: 13950416-n