niche-n
type: LexicalEntry
canonical form: niche
sense: 13947369-n
part of speech: noun

ecological niche-n
type: LexicalEntry
canonical form: ecological niche
sense: 13947369-n
part of speech: noun

13947369-n
type: LexicalConcept
in scheme: en-word.net
definition: (ecology) the status of an organism within its environment and community (affecting its survival as a species)
ili: i110118
lexfile: noun.state
part of speech: noun
domain topic: 06080479-n
hypernym: 13943868-n