condition-n
type: LexicalEntry
canonical form: condition
sense: 13946473-n
part of speech: noun

13946473-n
type: LexicalConcept
in scheme: en-word.net
definition: an illness, disease, or other medical problem
example: a heart condition
example: a skin condition
ili: i110112
lexfile: noun.state
part of speech: noun
hypernym: 14085287-n