conditions-n
type: LexicalEntry
canonical form: conditions
sense: 13946063-n
part of speech: noun

13946063-n
type: LexicalConcept
in scheme: en-word.net
definition: the set of circumstances that affect someone's welfare
example: hazardous working conditions
example: harsh living conditions
ili: i110110
lexfile: noun.state
part of speech: noun
exemplifies: 06306016-n
hypernym: 14536419-n