ray-n
type: LexicalEntry
canonical form: ray
sense: 13936442-n
part of speech: noun

13936442-n
type: LexicalConcept
in scheme: en-word.net
definition: (mathematics) a straight line extending from a point
ili: i110061
lexfile: noun.shape
part of speech: noun
domain topic: 06009822-n
hypernym: 13936278-n