indentation-n
type: LexicalEntry
canonical form: indentation
sense: 13931035-n
part of speech: noun

indenture-n
type: LexicalEntry
canonical form: indenture
sense: 13931035-n
part of speech: noun

13931035-n
type: LexicalConcept
in scheme: en-word.net
definition: a concave cut into a surface or edge (as in a coastline)
ili: i110029
lexfile: noun.shape
part of speech: noun
hypernym: 13887586-n