sphere-n
type: LexicalEntry
canonical form: sphere
sense: 13921893-n
part of speech: noun

13921893-n
type: LexicalConcept
in scheme: en-word.net
definition: a solid figure bounded by a spherical surface (including the space it encloses)
ili: i109981
lexfile: noun.shape
part of speech: noun
hypernym: 13888104-n